Reaction Details
TargetHistamine H4 receptor
LigandBDBM22560
Substrate/Competitorn/a
Meas. Tech.ChEMBL_634016 (CHEMBL1117989)
Ki 26±n/a nM
Citation Savall, BMEdwards, JPVenable, JDBuzard, DJThurmond, RHack, MMcGovern, P Agonist/antagonist modulation in a series of 2-aryl benzimidazole H4 receptor ligands. Bioorg Med Chem Lett20:3367-71 (2010) 
 
Histamine H4 receptor
Name:Histamine H4 receptor
Type:G Protein-Coupled Receptor (GPCR)
Mol. Mass.:44517.02
Organism:Homo sapiens (Human)
Description:Binding assays were using CHO cells stably expressing hH4R receptors.
Residue:390
BDBM22560
NameBDBM22560
Synonyms:2-arylbenzimidazole derivative, 6 | 5-tert-butyl-2-{3-chloro-4-[3-(4-methyl-1,4-diazepan-1-yl)propoxy]phenyl}-1H-1,3-benzodiazole
TypeSmall organic molecule
Emp. Form.C26H35ClN4O
Mol. Mass.455.035
SMILESCN1CCCN(CCCOc2ccc(cc2Cl)-c2nc3ccc(cc3[nH]2)C(C)(C)C)CC1