Reaction Details
TargetHistamine H4 receptor
LigandBDBM50319305
Substrate/Competitorn/a
Meas. Tech.ChEMBL_634016 (CHEMBL1117989)
Ki 609±n/a nM
Citation Savall, BMEdwards, JPVenable, JDBuzard, DJThurmond, RHack, MMcGovern, P Agonist/antagonist modulation in a series of 2-aryl benzimidazole H4 receptor ligands. Bioorg Med Chem Lett20:3367-71 (2010) 
 
Histamine H4 receptor
Name:Histamine H4 receptor
Type:G Protein-Coupled Receptor (GPCR)
Mol. Mass.:44517.02
Organism:Homo sapiens (Human)
Description:Binding assays were using CHO cells stably expressing hH4R receptors.
Residue:390
BDBM50319305
NameBDBM50319305
Synonyms:CHEMBL1085872 | N-(3-(4-(5-tert-butyl-1H-benzo[d]imidazol-2-yl)-2-chlorophenoxy)propyl)-N,1-dimethylpyrrolidin-3-amine
TypeSmall organic molecule
Emp. Form.C26H35ClN4O
Mol. Mass.455.035
SMILESCN(CCCOc1ccc(cc1Cl)-c1nc2ccc(cc2[nH]1)C(C)(C)C)C1CCN(C)C1