Reaction Details
TargetHistamine H4 receptor
LigandBDBM50319308
Substrate/Competitorn/a
Meas. Tech.ChEMBL_634016 (CHEMBL1117989)
Ki 557±n/a nM
Citation Savall, BMEdwards, JPVenable, JDBuzard, DJThurmond, RHack, MMcGovern, P Agonist/antagonist modulation in a series of 2-aryl benzimidazole H4 receptor ligands. Bioorg Med Chem Lett20:3367-71 (2010) 
 
Histamine H4 receptor
Name:Histamine H4 receptor
Type:G Protein-Coupled Receptor (GPCR)
Mol. Mass.:44517.02
Organism:Homo sapiens (Human)
Description:Binding assays were using CHO cells stably expressing hH4R receptors.
Residue:390
BDBM50319308
NameBDBM50319308
Synonyms:(+/-)-3-(4-(5-fluoro-4-methyl-1H-benzo[d]imidazol-2-yl)-3-methylphenoxy)-N-((1-methylpiperidin-3-yl)methyl)propan-1-amine | CHEMBL1084354
TypeSmall organic molecule
Emp. Form.C25H33FN4O
Mol. Mass.424.5541
SMILESCN1CCCC(CNCCCOc2ccc(-c3nc4ccc(F)c(C)c4[nH]3)c(C)c2)C1