Reaction Details
Target5-hydroxytryptamine receptor 2A
LigandBDBM50319424
Substrate/Competitorn/a
Meas. Tech.ChEMBL_634056 (CHEMBL1118328)
Ki 287±n/a nM
Citation Xiong, YTeegarden, BRChoi, JSStrah-Pleynet, SDecaire, MJayakumar, HDosa, PICasper, MDPham, LFeichtinger, KUllman, BAdams, JYuskin, DFrazer, JMorgan, MSadeque, AChen, WWebb, RRConnolly, DTSemple, GAl-Shamma, H Discovery and structure-activity relationship of 3-methoxy-N-(3-(1-methyl-1H-pyrazol-5-yl)-4-(2-morpholinoethoxy)phenyl)benzamide (APD791): a highly selective 5-hydroxytryptamine2A receptor inverse agonist for the treatment of arterial thrombosis. J Med Chem53:4412-21 (2010) 
 
5-hydroxytryptamine receptor 2A
Name:5-hydroxytryptamine receptor 2A
Type:undefined
Mol. Mass.:52607.65
Organism:Homo sapiens (Human)
Description:P28223
Residue:471
BDBM50319424
NameBDBM50319424
Synonyms:CHEMBL1084618 | N-{3-(2-Methyl-2H-pyrazol-3-yl)-4-[2-(3-oxo-piperazin-1-yl)-ethoxy]-phenyl}-3-trifluoromethyl-benzamide
TypeSmall organic molecule
Emp. Form.C24H24F3N5O3
Mol. Mass.487.4743
SMILESCn1nccc1-c1cc(NC(=O)c2cccc(c2)C(F)(F)F)ccc1OCCN1CCNC(=O)C1