Reaction Details
Target5-hydroxytryptamine receptor 2A
LigandBDBM50319431
Substrate/Competitorn/a
Meas. Tech.ChEMBL_634056 (CHEMBL1118328)
Ki 28±n/a nM
Citation Xiong, YTeegarden, BRChoi, JSStrah-Pleynet, SDecaire, MJayakumar, HDosa, PICasper, MDPham, LFeichtinger, KUllman, BAdams, JYuskin, DFrazer, JMorgan, MSadeque, AChen, WWebb, RRConnolly, DTSemple, GAl-Shamma, H Discovery and structure-activity relationship of 3-methoxy-N-(3-(1-methyl-1H-pyrazol-5-yl)-4-(2-morpholinoethoxy)phenyl)benzamide (APD791): a highly selective 5-hydroxytryptamine2A receptor inverse agonist for the treatment of arterial thrombosis. J Med Chem53:4412-21 (2010) 
 
5-hydroxytryptamine receptor 2A
Name:5-hydroxytryptamine receptor 2A
Type:undefined
Mol. Mass.:52607.65
Organism:Homo sapiens (Human)
Description:P28223
Residue:471
BDBM50319431
NameBDBM50319431
Synonyms:3-Methoxy-N-{3-(1-methyl-1H-pyrazol-5-yl)-4-[2-(4-(methylsulfonyl)piperazin-1-yl)ethoxy]phenyl}benzamide | CHEMBL1082473
TypeSmall organic molecule
Emp. Form.C25H31N5O5S
Mol. Mass.513.609
SMILESCOc1cccc(c1)C(=O)Nc1ccc(OCCN2CCN(CC2)S(C)(=O)=O)c(c1)-c1ccnn1C