Reaction Details
Target5-hydroxytryptamine receptor 2C
LigandBDBM50319428
Substrate/Competitorn/a
Meas. Tech.ChEMBL_634057 (CHEMBL1118329)
Ki 8600±n/a nM
Citation Xiong, YTeegarden, BRChoi, JSStrah-Pleynet, SDecaire, MJayakumar, HDosa, PICasper, MDPham, LFeichtinger, KUllman, BAdams, JYuskin, DFrazer, JMorgan, MSadeque, AChen, WWebb, RRConnolly, DTSemple, GAl-Shamma, H Discovery and structure-activity relationship of 3-methoxy-N-(3-(1-methyl-1H-pyrazol-5-yl)-4-(2-morpholinoethoxy)phenyl)benzamide (APD791): a highly selective 5-hydroxytryptamine2A receptor inverse agonist for the treatment of arterial thrombosis. J Med Chem53:4412-21 (2010) 
 
5-hydroxytryptamine receptor 2C
Name:5-hydroxytryptamine receptor 2C
Type:G Protein-Coupled Receptor (GPCR)
Mol. Mass.:51836.79
Organism:Homo sapiens (Human)
Description:P28335
Residue:458
BDBM50319428
NameBDBM50319428
Synonyms:CHEMBL1085628 | N-{4-[2-(4-Acetylpiperazin-1-yl)ethoxy]-3-(4-chloro-1-methyl-1H-pyrazol-5-yl)phenyl}-3-fluorobenzamide
TypeSmall organic molecule
Emp. Form.C25H27ClFN5O3
Mol. Mass.499.965
SMILESCC(=O)N1CCN(CCOc2ccc(NC(=O)c3cccc(F)c3)cc2-c2c(Cl)cnn2C)CC1