Reaction Details
Target5-hydroxytryptamine receptor 2C
LigandBDBM50319430
Substrate/Competitorn/a
Meas. Tech.ChEMBL_634057 (CHEMBL1118329)
Ki 5890±n/a nM
Citation Xiong, YTeegarden, BRChoi, JSStrah-Pleynet, SDecaire, MJayakumar, HDosa, PICasper, MDPham, LFeichtinger, KUllman, BAdams, JYuskin, DFrazer, JMorgan, MSadeque, AChen, WWebb, RRConnolly, DTSemple, GAl-Shamma, H Discovery and structure-activity relationship of 3-methoxy-N-(3-(1-methyl-1H-pyrazol-5-yl)-4-(2-morpholinoethoxy)phenyl)benzamide (APD791): a highly selective 5-hydroxytryptamine2A receptor inverse agonist for the treatment of arterial thrombosis. J Med Chem53:4412-21 (2010) 
 
5-hydroxytryptamine receptor 2C
Name:5-hydroxytryptamine receptor 2C
Type:G Protein-Coupled Receptor (GPCR)
Mol. Mass.:51836.79
Organism:Homo sapiens (Human)
Description:P28335
Residue:458
BDBM50319430
NameBDBM50319430
Synonyms:4-{2-[4-(3-Methoxy-benzoylamino)-2-(2-methyl-2H-pyrazol-3-yl)-phenoxy]-ethyl}-piperazine-1-carboxylicAcid Amide | CHEMBL1083725
TypeSmall organic molecule
Emp. Form.C25H30N6O4
Mol. Mass.478.5435
SMILESCOc1cccc(c1)C(=O)Nc1ccc(OCCN2CCN(CC2)C(N)=O)c(c1)-c1ccnn1C