Reaction Details
Target5-hydroxytryptamine receptor 2B
LigandBDBM50319423
Substrate/Competitorn/a
Meas. Tech.ChEMBL_634177 (CHEMBL1119616)
Ki>10000±n/a nM
Citation Xiong, YTeegarden, BRChoi, JSStrah-Pleynet, SDecaire, MJayakumar, HDosa, PICasper, MDPham, LFeichtinger, KUllman, BAdams, JYuskin, DFrazer, JMorgan, MSadeque, AChen, WWebb, RRConnolly, DTSemple, GAl-Shamma, H Discovery and structure-activity relationship of 3-methoxy-N-(3-(1-methyl-1H-pyrazol-5-yl)-4-(2-morpholinoethoxy)phenyl)benzamide (APD791): a highly selective 5-hydroxytryptamine2A receptor inverse agonist for the treatment of arterial thrombosis. J Med Chem53:4412-21 (2010) 
 
5-hydroxytryptamine receptor 2B
Name:5-hydroxytryptamine receptor 2B
Type:G Protein-Coupled Receptor (GPCR)
Mol. Mass.:54312.47
Organism:Homo sapiens (Human)
Description:Receptor binding assays were performed using human clone stably expressed in CHO cells.
Residue:481
BDBM50319423
NameBDBM50319423
Synonyms:3-Methoxy-N-[3-(2-methyl-2H-pyrazol-3-yl)-4-(2-morpholin-4-yl-ethoxy)-phenyl]-benzamide | CHEMBL1084617
TypeSmall organic molecule
Emp. Form.C24H28N4O4
Mol. Mass.436.5035
SMILESCOc1cccc(c1)C(=O)Nc1ccc(OCCN2CCOCC2)c(c1)-c1ccnn1C