Reaction Details
TargetProstaglandin D2 receptor 2
LigandBDBM50319487
Substrate/Competitorn/a
Meas. Tech.ChEMBL_634231 (CHEMBL1120178)
Ki 13±n/a nM
Citation Tumey, LNRobarge, MJGleason, ESong, JMurphy, SMEkema, GDoucette, CHanniford, DPalmer, MPawlowski, GDanzig, JLoftus, MHunady, KSherf, BMays, RWStricker-Krongrad, ABrunden, KRBennani, YLHarrington, JJ 3-Indolyl sultams as selective CRTh2 antagonists. Bioorg Med Chem Lett20:3287-90 (2010) 
 
Prostaglandin D2 receptor 2
Name:Prostaglandin D2 receptor 2
Type:Enzyme
Mol. Mass.:43295.45
Organism:Homo sapiens (Human)
Description:Q9Y5Y4
Residue:395
BDBM50319487
NameBDBM50319487
Synonyms:CHEMBL1084894 | rac-{2-Methyl-3-[2-(3-methyl-5-phenyl-isoxazol-4-ylmethyl)-1,1-dioxo-2,3-dihydro-1H-1lambda*6*-benzo[d]isothiazol-3-yl]-indol-1-yl}-acetic acid
TypeSmall organic molecule
Emp. Form.C29H25N3O5S
Mol. Mass.527.591
SMILESCc1noc(c1CN1C(c2ccccc2S1(=O)=O)c1c(C)n(CC(O)=O)c2ccccc12)-c1ccccc1