Reaction Details
TargetHistamine H3 receptor
LigandBDBM50224189
Substrate/Competitorn/a
Meas. Tech.ChEMBL_634305 (CHEMBL1120718)
Ki 0.72±n/a nM
Citation Liu, HAltenbach, RJDiaz, GJManelli, AMMartin, RLMiller, TREsbenshade, TABrioni, JDCowart, MD In vitro studies on a class of quinoline containing histamine H3 antagonists. Bioorg Med Chem Lett20:3295-300 (2010) 
 
Histamine H3 receptor
Name:Histamine H3 receptor
Type:G Protein-Coupled Receptor (GPCR)
Mol. Mass.:48607.98
Organism:Rattus norvegicus (rat)
Description:n/a
Residue:445
BDBM50224189
NameBDBM50224189
Synonyms:(R)-2-(4-methyl-2-(pyrrolidin-1-yl)pyrimidin-5-yl)-6-(2-(2-methylpyrrolidin-1-yl)ethyl)quinoline CHEMBL237191
TypeSmall organic molecule
Emp. Form.C25H31N5
Mol. Mass.401.5471
SMILESC[C@@H]1CCCN1CCc1ccc2nc(ccc2c1)-c1cnc(nc1C)N1CCCC1