Reaction Details
TargetHistamine H3 receptor
LigandBDBM50319544
Substrate/Competitorn/a
Meas. Tech.ChEMBL_634305 (CHEMBL1120718)
Ki 1.9±n/a nM
Citation Liu, HAltenbach, RJDiaz, GJManelli, AMMartin, RLMiller, TREsbenshade, TABrioni, JDCowart, MD In vitro studies on a class of quinoline containing histamine H3 antagonists. Bioorg Med Chem Lett20:3295-300 (2010) 
 
Histamine H3 receptor
Name:Histamine H3 receptor
Type:G Protein-Coupled Receptor (GPCR)
Mol. Mass.:48607.98
Organism:Rattus norvegicus (rat)
Description:n/a
Residue:445
BDBM50319544
NameBDBM50319544
Synonyms:(R)-4-methyl-5-(6-(2-(2-methylpyrrolidin-1-yl)ethyl)quinolin-2-yl)-2-(pyridin-3-yl)thiazole | CHEMBL1082606
TypeSmall organic molecule
Emp. Form.C25H26N4S
Mol. Mass.414.566
SMILESC[C@@H]1CCCN1CCc1ccc2nc(ccc2c1)-c1sc(nc1C)-c1cccnc1