Reaction Details
TargetHistamine H3 receptor
LigandBDBM50319554
Substrate/Competitorn/a
Meas. Tech.ChEMBL_634305 (CHEMBL1120718)
Ki 0.5±n/a nM
Citation Liu, HAltenbach, RJDiaz, GJManelli, AMMartin, RLMiller, TREsbenshade, TABrioni, JDCowart, MD In vitro studies on a class of quinoline containing histamine H3 antagonists. Bioorg Med Chem Lett20:3295-300 (2010) 
 
Histamine H3 receptor
Name:Histamine H3 receptor
Type:G Protein-Coupled Receptor (GPCR)
Mol. Mass.:48607.98
Organism:Rattus norvegicus (rat)
Description:n/a
Residue:445
BDBM50319554
NameBDBM50319554
Synonyms:(R)-2-(2-methylimidazo[1,2-a]pyridin-3-yl)-6-(2-(2-methylpyrrolidin-1-yl)ethyl)quinoline | CHEMBL1084385
TypeSmall organic molecule
Emp. Form.C24H26N4
Mol. Mass.370.49
SMILESC[C@@H]1CCCN1CCc1ccc2nc(ccc2c1)-c1c(C)nc2ccccn12