Reaction Details
TargetPotassium voltage-gated channel subfamily H member 2
LigandBDBM50224189
Substrate/Competitorn/a
Meas. Tech.ChEMBL_634306 (CHEMBL1120719)
Ki 2600±n/a nM
Citation Liu, HAltenbach, RJDiaz, GJManelli, AMMartin, RLMiller, TREsbenshade, TABrioni, JDCowart, MD In vitro studies on a class of quinoline containing histamine H3 antagonists. Bioorg Med Chem Lett20:3295-300 (2010) 
 
Potassium voltage-gated channel subfamily H member 2
Name:Potassium voltage-gated channel subfamily H member 2
Type:Multi-pass membrane protein
Mol. Mass.:126672.65
Organism:Homo sapiens (Human)
Description:Q12809
Residue:1159
BDBM50224189
NameBDBM50224189
Synonyms:(R)-2-(4-methyl-2-(pyrrolidin-1-yl)pyrimidin-5-yl)-6-(2-(2-methylpyrrolidin-1-yl)ethyl)quinoline CHEMBL237191
TypeSmall organic molecule
Emp. Form.C25H31N5
Mol. Mass.401.5471
SMILESC[C@@H]1CCCN1CCc1ccc2nc(ccc2c1)-c1cnc(nc1C)N1CCCC1