Reaction Details
TargetPotassium voltage-gated channel subfamily H member 2
LigandBDBM50319554
Substrate/Competitorn/a
Meas. Tech.ChEMBL_634306 (CHEMBL1120719)
Ki 2000±n/a nM
Citation Liu, HAltenbach, RJDiaz, GJManelli, AMMartin, RLMiller, TREsbenshade, TABrioni, JDCowart, MD In vitro studies on a class of quinoline containing histamine H3 antagonists. Bioorg Med Chem Lett20:3295-300 (2010) 
 
Potassium voltage-gated channel subfamily H member 2
Name:Potassium voltage-gated channel subfamily H member 2
Type:Multi-pass membrane protein
Mol. Mass.:126672.65
Organism:Homo sapiens (Human)
Description:Q12809
Residue:1159
BDBM50319554
NameBDBM50319554
Synonyms:(R)-2-(2-methylimidazo[1,2-a]pyridin-3-yl)-6-(2-(2-methylpyrrolidin-1-yl)ethyl)quinoline | CHEMBL1084385
TypeSmall organic molecule
Emp. Form.C24H26N4
Mol. Mass.370.49
SMILESC[C@@H]1CCCN1CCc1ccc2nc(ccc2c1)-c1c(C)nc2ccccn12