Reaction Details
TargetHistamine H3 receptor
LigandBDBM50319527
Substrate/Competitorn/a
Meas. Tech.ChEMBL_634304 (CHEMBL1120717)
Ki 0.2±n/a nM
Citation Liu, HAltenbach, RJDiaz, GJManelli, AMMartin, RLMiller, TREsbenshade, TABrioni, JDCowart, MD In vitro studies on a class of quinoline containing histamine H3 antagonists. Bioorg Med Chem Lett20:3295-300 (2010) 
 
Histamine H3 receptor
Name:Histamine H3 receptor
Type:G Protein-Coupled Receptor (GPCR)
Mol. Mass.:48691.47
Organism:Homo sapiens (Human)
Description:Binding assays were using CHO cells stably expressing hH3R receptors.
Residue:445
BDBM50319527
NameBDBM50319527
Synonyms:(R)-2-(3-methyl-1H-pyrazol-4-yl)-6-(2-(2-methylpyrrolidin-1-yl)ethyl)quinoline | CHEMBL1084314
TypeSmall organic molecule
Emp. Form.C20H24N4
Mol. Mass.320.4314
SMILESC[C@@H]1CCCN1CCc1ccc2nc(ccc2c1)-c1cn[nH]c1C