Reaction Details
TargetHistamine H3 receptor
LigandBDBM50319547
Substrate/Competitorn/a
Meas. Tech.ChEMBL_634304 (CHEMBL1120717)
Ki 0.16±n/a nM
Citation Liu, HAltenbach, RJDiaz, GJManelli, AMMartin, RLMiller, TREsbenshade, TABrioni, JDCowart, MD In vitro studies on a class of quinoline containing histamine H3 antagonists. Bioorg Med Chem Lett20:3295-300 (2010) 
 
Histamine H3 receptor
Name:Histamine H3 receptor
Type:G Protein-Coupled Receptor (GPCR)
Mol. Mass.:48691.47
Organism:Homo sapiens (Human)
Description:Binding assays were using CHO cells stably expressing hH3R receptors.
Residue:445
BDBM50319547
NameBDBM50319547
Synonyms:(R)-3-(4-chlorophenyl)-5-methyl-4-(6-(2-(2-methylpyrrolidin-1-yl)ethyl)quinolin-2-yl)isoxazole | CHEMBL1085396
TypeSmall organic molecule
Emp. Form.C26H26ClN3O
Mol. Mass.431.957
SMILESC[C@@H]1CCCN1CCc1ccc2nc(ccc2c1)-c1c(C)onc1-c1ccc(Cl)cc1