Reaction Details
TargetHistamine H3 receptor
LigandBDBM50319549
Substrate/Competitorn/a
Meas. Tech.ChEMBL_634304 (CHEMBL1120717)
Ki 0.1±n/a nM
Citation Liu, HAltenbach, RJDiaz, GJManelli, AMMartin, RLMiller, TREsbenshade, TABrioni, JDCowart, MD In vitro studies on a class of quinoline containing histamine H3 antagonists. Bioorg Med Chem Lett20:3295-300 (2010) 
 
Histamine H3 receptor
Name:Histamine H3 receptor
Type:G Protein-Coupled Receptor (GPCR)
Mol. Mass.:48691.47
Organism:Homo sapiens (Human)
Description:Binding assays were using CHO cells stably expressing hH3R receptors.
Residue:445
BDBM50319549
NameBDBM50319549
Synonyms:(R)-5-methyl-4-(6-(2-(2-methylpyrrolidin-1-yl)ethyl)quinolin-2-yl)-3-phenylisoxazole | CHEMBL1085398
TypeSmall organic molecule
Emp. Form.C26H27N3O
Mol. Mass.397.5121
SMILESC[C@@H]1CCCN1CCc1ccc2nc(ccc2c1)-c1c(C)onc1-c1ccccc1