Reaction Details
TargetHistamine H3 receptor
LigandBDBM50319512
Substrate/Competitorn/a
Meas. Tech.ChEMBL_634305 (CHEMBL1120718)
Ki 0.45±n/a nM
Citation Liu, HAltenbach, RJDiaz, GJManelli, AMMartin, RLMiller, TREsbenshade, TABrioni, JDCowart, MD In vitro studies on a class of quinoline containing histamine H3 antagonists. Bioorg Med Chem Lett20:3295-300 (2010) 
 
Histamine H3 receptor
Name:Histamine H3 receptor
Type:G Protein-Coupled Receptor (GPCR)
Mol. Mass.:48607.98
Organism:Rattus norvegicus (rat)
Description:n/a
Residue:445
BDBM50319512
NameBDBM50319512
Synonyms:(R)-2-(6-methylpyridin-3-yl)-6-(2-(2-methylpyrrolidin-1-yl)ethyl)quinoline | CHEMBL1082781
TypeSmall organic molecule
Emp. Form.C22H25N3
Mol. Mass.331.454
SMILESC[C@@H]1CCCN1CCc1ccc2nc(ccc2c1)-c1ccc(C)nc1