Reaction Details
TargetAngiopoietin-1 receptor
LigandBDBM50266188
Substrate/Competitorn/a
Meas. Tech.ChEMBL_634312 (CHEMBL1120725)
IC50 44±n/a nM
Citation Cheng, ACEksterowicz, JGeuns-Meyer, SSun, Y Analysis of kinase inhibitor selectivity using a thermodynamics-based partition index. J Med Chem53:4502-10 (2010) 
 
Angiopoietin-1 receptor
Name:Angiopoietin-1 receptor
Type:Enzyme
Mol. Mass.:125835.70
Organism:Homo sapiens (Human)
Description:Q02763
Residue:1124
BDBM50266188
NameBDBM50266188
Synonyms:CHEMBL456683 | N-(4-(3-(2-(methylamino)pyrimidin-4-yl)pyridin-2-yloxy)naphthalen-1-yl)benzo[d]thiazol-2-amine
TypeSmall organic molecule
Emp. Form.C27H20N6OS
Mol. Mass.476.552
SMILESCNc1nccc(n1)-c1cccnc1Oc1ccc(Nc2nc3ccccc3s2)c2ccccc12