Reaction Details
TargetAurora kinase A
LigandBDBM50319569
Substrate/Competitorn/a
Meas. Tech.ChEMBL_634309 (CHEMBL1120722)
IC50 225±n/a nM
Citation Cheng, ACEksterowicz, JGeuns-Meyer, SSun, Y Analysis of kinase inhibitor selectivity using a thermodynamics-based partition index. J Med Chem53:4502-10 (2010) 
 
Aurora kinase A
Name:Aurora kinase A
Type:Serine/threonine-protein kinase
Mol. Mass.:45830.98
Organism:Homo sapiens (Human)
Description:O14965
Residue:403
BDBM50319569
NameBDBM50319569
Synonyms:1-tert-butyl-3-(4-(3-(2-(methylamino)pyrimidin-4-yl)pyridin-2-yloxy)naphthalen-1-yl)urea | CHEMBL1084633
TypeSmall organic molecule
Emp. Form.C25H26N6O2
Mol. Mass.442.5129
SMILESCNc1nccc(n1)-c1cccnc1Oc1ccc(NC(=O)NC(C)(C)C)c2ccccc12