Reaction Details
TargetAngiopoietin-1 receptor
LigandBDBM50266221
Substrate/Competitorn/a
Meas. Tech.ChEMBL_634312 (CHEMBL1120725)
IC50 2±n/a nM
Citation Cheng, ACEksterowicz, JGeuns-Meyer, SSun, Y Analysis of kinase inhibitor selectivity using a thermodynamics-based partition index. J Med Chem53:4502-10 (2010) 
 
Angiopoietin-1 receptor
Name:Angiopoietin-1 receptor
Type:Enzyme
Mol. Mass.:125835.70
Organism:Homo sapiens (Human)
Description:Q02763
Residue:1124
BDBM50266221
NameBDBM50266221
Synonyms:CHEMBL458023 N-[3-methyl-4-({3-[2-(methylamino)pyrimidin-4-yl]pyridin-2-yl}oxy)naphthalen-1-yl]-1H-benzimidazol-2-amine
TypeSmall organic molecule
Emp. Form.C28H23N7O
Mol. Mass.473.5285
SMILESCNc1nccc(n1)-c1cccnc1Oc1c(C)cc(Nc2nc3ccccc3[nH]2)c2ccccc12