Reaction Details
TargetAurora kinase A
LigandBDBM50319573
Substrate/Competitorn/a
Meas. Tech.ChEMBL_634309 (CHEMBL1120722)
IC50 1658±n/a nM
Citation Cheng, ACEksterowicz, JGeuns-Meyer, SSun, Y Analysis of kinase inhibitor selectivity using a thermodynamics-based partition index. J Med Chem53:4502-10 (2010) 
 
Aurora kinase A
Name:Aurora kinase A
Type:Serine/threonine-protein kinase
Mol. Mass.:45830.98
Organism:Homo sapiens (Human)
Description:O14965
Residue:403
BDBM50319573
NameBDBM50319573
Synonyms:CHEMBL1084453 | N1-(4-(2-(4-(1H-benzo[d]imidazol-2-ylamino)naphthalen-1-yloxy)pyridin-3-yl)pyrimidin-2-yl)-N3,N3,2,2-tetramethylpropane-1,3-diamine
TypeSmall organic molecule
Emp. Form.C33H34N8O
Mol. Mass.558.6761
SMILESCN(C)CC(C)(C)CNc1nccc(n1)-c1cccnc1Oc1ccc(Nc2nc3ccccc3[nH]2)c2ccccc12