Reaction Details
TargetTyrosine-protein kinase Lck
LigandBDBM50319573
Substrate/Competitorn/a
Meas. Tech.ChEMBL_634311 (CHEMBL1120724)
IC50 10000±n/a nM
Citation Cheng, ACEksterowicz, JGeuns-Meyer, SSun, Y Analysis of kinase inhibitor selectivity using a thermodynamics-based partition index. J Med Chem53:4502-10 (2010) 
 
Tyrosine-protein kinase Lck
Name:Tyrosine-protein kinase Lck
Type:n/a
Mol. Mass.:57987.83
Organism:Homo sapiens (Human)
Description:P06239
Residue:509
BDBM50319573
NameBDBM50319573
Synonyms:CHEMBL1084453 | N1-(4-(2-(4-(1H-benzo[d]imidazol-2-ylamino)naphthalen-1-yloxy)pyridin-3-yl)pyrimidin-2-yl)-N3,N3,2,2-tetramethylpropane-1,3-diamine
TypeSmall organic molecule
Emp. Form.C33H34N8O
Mol. Mass.558.6761
SMILESCN(C)CC(C)(C)CNc1nccc(n1)-c1cccnc1Oc1ccc(Nc2nc3ccccc3[nH]2)c2ccccc12