Reaction Details
TargetCyclin-dependent kinase 2
LigandBDBM50319615
Substrate/Competitorn/a
Meas. Tech.ChEMBL_634455 (CHEMBL1119481)
Ki 297±n/a nM
Citation Wang, SMidgley, CAScaërou, FGrabarek, JBGriffiths, GJackson, WKontopidis, GMcClue, SJMcInnes, CMeades, CMezna, MPlater, AStuart, IThomas, MPWood, GClarke, RGBlake, DGZheleva, DILane, DPJackson, RCGlover, DMFischer, PM Discovery of N-phenyl-4-(thiazol-5-yl)pyrimidin-2-amine aurora kinase inhibitors. J Med Chem53:4367-78 (2010) 
 
Cyclin-dependent kinase 2
Name:Cyclin-dependent kinase 2
Type:Enzyme Subunit
Mol. Mass.:33938.17
Organism:Homo sapiens (Human)
Description:P24941
Residue:298
BDBM50319615
NameBDBM50319615
Synonyms:1-(4-(4-(4-(4-Methyl-2-(methylamino)thiazol-5-yl)pyrimidin-2-ylamino)phenyl)piperazin-1-yl)ethanone | CHEMBL1083785
TypeSmall organic molecule
Emp. Form.C21H25N7OS
Mol. Mass.423.535
SMILESCNc1nc(C)c(s1)-c1ccnc(Nc2ccc(cc2)N2CCN(CC2)C(C)=O)n1