Reaction Details
TargetAurora kinase A
LigandBDBM50319621
Substrate/Competitorn/a
Meas. Tech.ChEMBL_634451 (CHEMBL1119477)
Ki 3±n/a nM
Citation Wang, SMidgley, CAScaërou, FGrabarek, JBGriffiths, GJackson, WKontopidis, GMcClue, SJMcInnes, CMeades, CMezna, MPlater, AStuart, IThomas, MPWood, GClarke, RGBlake, DGZheleva, DILane, DPJackson, RCGlover, DMFischer, PM Discovery of N-phenyl-4-(thiazol-5-yl)pyrimidin-2-amine aurora kinase inhibitors. J Med Chem53:4367-78 (2010) 
 
Aurora kinase A
Name:Aurora kinase A
Type:Serine/threonine-protein kinase
Mol. Mass.:45830.98
Organism:Homo sapiens (Human)
Description:O14965
Residue:403
BDBM50319621
NameBDBM50319621
Synonyms:CHEMBL1086088 | N-Ethyl-4-methyl-5-(2-(3,4,5-trimethoxyphenylamino)pyrimidin-4-yl)thiazol-2-amine
TypeSmall organic molecule
Emp. Form.C19H23N5O3S
Mol. Mass.401.483
SMILESCCNc1nc(C)c(s1)-c1ccnc(Nc2cc(OC)c(OC)c(OC)c2)n1