Reaction Details
TargetCyclin-dependent kinase 7
LigandBDBM50319617
Substrate/Competitorn/a
Meas. Tech.ChEMBL_634457 (CHEMBL1119483)
Ki>10000±n/a nM
Citation Wang, SMidgley, CAScaërou, FGrabarek, JBGriffiths, GJackson, WKontopidis, GMcClue, SJMcInnes, CMeades, CMezna, MPlater, AStuart, IThomas, MPWood, GClarke, RGBlake, DGZheleva, DILane, DPJackson, RCGlover, DMFischer, PM Discovery of N-phenyl-4-(thiazol-5-yl)pyrimidin-2-amine aurora kinase inhibitors. J Med Chem53:4367-78 (2010) 
 
Cyclin-dependent kinase 7
Name:Cyclin-dependent kinase 7
Type:Enzyme Subunit
Mol. Mass.:39047.01
Organism:Homo sapiens (Human)
Description:n/a
Residue:346
BDBM50319617
NameBDBM50319617
Synonyms:CHEMBL1084630 | N-Ethyl-4-methyl-5-(2-(4-morpholinophenylamino)pyrimidin-4-yl)thiazol-2-amine
TypeSmall organic molecule
Emp. Form.C20H24N6OS
Mol. Mass.396.509
SMILESCCNc1nc(C)c(s1)-c1ccnc(Nc2ccc(cc2)N2CCOCC2)n1