Reaction Details
TargetCyclin-dependent kinase 4
LigandBDBM50319619
Substrate/Competitorn/a
Meas. Tech.ChEMBL_634456 (CHEMBL1119482)
Ki 2170±n/a nM
Citation Wang, SMidgley, CAScaërou, FGrabarek, JBGriffiths, GJackson, WKontopidis, GMcClue, SJMcInnes, CMeades, CMezna, MPlater, AStuart, IThomas, MPWood, GClarke, RGBlake, DGZheleva, DILane, DPJackson, RCGlover, DMFischer, PM Discovery of N-phenyl-4-(thiazol-5-yl)pyrimidin-2-amine aurora kinase inhibitors. J Med Chem53:4367-78 (2010) 
 
Cyclin-dependent kinase 4
Name:Cyclin-dependent kinase 4
Type:Enzyme Subunit
Mol. Mass.:33731.96
Organism:Homo sapiens (Human)
Description:P11802
Residue:303
BDBM50319619
NameBDBM50319619
Synonyms:4-(2,4-Dimethylthiazol-5-yl)-N-(4-morpholinophenyl)pyrimidin-2-amine CHEMBL1085626
TypeSmall organic molecule
Emp. Form.C19H21N5OS
Mol. Mass.367.468
SMILESCc1nc(C)c(s1)-c1ccnc(Nc2ccc(cc2)N2CCOCC2)n1