Reaction Details
TargetCyclin-dependent kinase 4
LigandBDBM50319622
Substrate/Competitorn/a
Meas. Tech.ChEMBL_634456 (CHEMBL1119482)
Ki 955±n/a nM
Citation Wang, SMidgley, CAScaërou, FGrabarek, JBGriffiths, GJackson, WKontopidis, GMcClue, SJMcInnes, CMeades, CMezna, MPlater, AStuart, IThomas, MPWood, GClarke, RGBlake, DGZheleva, DILane, DPJackson, RCGlover, DMFischer, PM Discovery of N-phenyl-4-(thiazol-5-yl)pyrimidin-2-amine aurora kinase inhibitors. J Med Chem53:4367-78 (2010) 
 
Cyclin-dependent kinase 4
Name:Cyclin-dependent kinase 4
Type:Enzyme Subunit
Mol. Mass.:33731.96
Organism:Homo sapiens (Human)
Description:P11802
Residue:303
BDBM50319622
NameBDBM50319622
Synonyms:CHEMBL1083152 | N,4-Dimethyl-5-(2-(3,4,5-trimethoxyphenylamino)pyrimidin-4-yl)thiazol-2-amine
TypeSmall organic molecule
Emp. Form.C18H21N5O3S
Mol. Mass.387.456
SMILESCNc1nc(C)c(s1)-c1ccnc(Nc2cc(OC)c(OC)c(OC)c2)n1