Reaction Details
TargetCyclin-dependent kinase 2
LigandBDBM50277583
Substrate/Competitorn/a
Meas. Tech.ChEMBL_634455 (CHEMBL1119481)
Ki 390±n/a nM
Citation Wang, SMidgley, CAScaërou, FGrabarek, JBGriffiths, GJackson, WKontopidis, GMcClue, SJMcInnes, CMeades, CMezna, MPlater, AStuart, IThomas, MPWood, GClarke, RGBlake, DGZheleva, DILane, DPJackson, RCGlover, DMFischer, PM Discovery of N-phenyl-4-(thiazol-5-yl)pyrimidin-2-amine aurora kinase inhibitors. J Med Chem53:4367-78 (2010) 
 
Cyclin-dependent kinase 2
Name:Cyclin-dependent kinase 2
Type:Enzyme Subunit
Mol. Mass.:33938.17
Organism:Homo sapiens (Human)
Description:P24941
Residue:298
BDBM50277583
NameBDBM50277583
Synonyms:2-amino-4-methyl-1,3-thiazol-5-yl)-N-[4-(morpholin-4-yl)phenyl]pyrimidin-2-amine, 5 Aminopyrimidine, 9 CYC-116
TypeSmall organic molecule
Emp. Form.C18H20N6OS
Mol. Mass.368.456
SMILESCc1nc(N)sc1-c1ccnc(Nc2ccc(cc2)N2CCOCC2)n1