Reaction Details
TargetMyotonin-protein kinase
LigandBDBM50319634
Substrate/Competitorn/a
Meas. Tech.ChEMBL_634590 (CHEMBL1117931)
IC50>8000±n/a nM
Citation Wu, FBüttner, FHChen, RHickey, EJakes, SKaplita, PKashem, MAKerr, SKugler, SPaw, ZProkopowicz, AShih, CKSnow, RYoung, ECywin, CL Substituted 2H-isoquinolin-1-one as potent Rho-Kinase inhibitors. Part 1: Hit-to-lead account. Bioorg Med Chem Lett20:3235-9 (2010) 
 
Myotonin-protein kinase
Name:Myotonin-protein kinase
Type:Enzyme Catalytic Domain
Mol. Mass.:69359.66
Organism:Homo sapiens (Human)
Description:gi_47059024
Residue:629
BDBM50319634
NameBDBM50319634
Synonyms:CHEMBL1084892 | N-(7-chloro-1-oxo-1,2-dihydroisoquinolin-6-yl)-2-(methylamino)-2-phenylacetamide
TypeSmall organic molecule
Emp. Form.C18H16ClN3O2
Mol. Mass.341.792
SMILESCNC(C(=O)Nc1cc2cc[nH]c(=O)c2cc1Cl)c1ccccc1