Reaction Details
TargetRho-associated protein kinase 2
LigandBDBM50319645
Substrate/Competitorn/a
Meas. Tech.ChEMBL_634586 (CHEMBL1117927)
IC50>10000±n/a nM
Citation Wu, FBüttner, FHChen, RHickey, EJakes, SKaplita, PKashem, MAKerr, SKugler, SPaw, ZProkopowicz, AShih, CKSnow, RYoung, ECywin, CL Substituted 2H-isoquinolin-1-one as potent Rho-Kinase inhibitors. Part 1: Hit-to-lead account. Bioorg Med Chem Lett20:3235-9 (2010) 
 
Rho-associated protein kinase 2
Name:Rho-associated protein kinase 2
Type:Protein
Mol. Mass.:160885.43
Organism:Homo sapiens (Human)
Description:O75116
Residue:1388
BDBM50319645
NameBDBM50319645
Synonyms:CHEMBL1084844 | N-(4-oxo-3,4-dihydroquinazolin-5-yl)-2-phenylacetamide
TypeSmall organic molecule
Emp. Form.C16H13N3O2
Mol. Mass.279.2933
SMILESO=C(Cc1ccccc1)Nc1cccc2nc[nH]c(=O)c12