Reaction Details
TargetRho-associated protein kinase 2
LigandBDBM14027
Substrate/Competitorn/a
Meas. Tech.ChEMBL_634586 (CHEMBL1117927)
IC50 400±n/a nM
Citation Wu, FBüttner, FHChen, RHickey, EJakes, SKaplita, PKashem, MAKerr, SKugler, SPaw, ZProkopowicz, AShih, CKSnow, RYoung, ECywin, CL Substituted 2H-isoquinolin-1-one as potent Rho-Kinase inhibitors. Part 1: Hit-to-lead account. Bioorg Med Chem Lett20:3235-9 (2010) 
 
Rho-associated protein kinase 2
Name:Rho-associated protein kinase 2
Type:Protein
Mol. Mass.:160885.43
Organism:Homo sapiens (Human)
Description:O75116
Residue:1388
BDBM14027
NameBDBM14027
Synonyms:5-(1,4-diazepan-1-ylsulfonyl)isoquinoline AT877 CHEMBL541388 HA-1077 cid_163751
TypeSmall organic molecule
Emp. Form.C14H17N3O2S
Mol. Mass.291.369
SMILESO=S(=O)(N1CCCNCC1)c1cccc2cnccc12