Reaction Details
TargetProtein kinase C epsilon type
LigandBDBM50319633
Substrate/Competitorn/a
Meas. Tech.ChEMBL_634589 (CHEMBL1117930)
IC50>8000±n/a nM
Citation Wu, FBüttner, FHChen, RHickey, EJakes, SKaplita, PKashem, MAKerr, SKugler, SPaw, ZProkopowicz, AShih, CKSnow, RYoung, ECywin, CL Substituted 2H-isoquinolin-1-one as potent Rho-Kinase inhibitors. Part 1: Hit-to-lead account. Bioorg Med Chem Lett20:3235-9 (2010) 
 
Protein kinase C epsilon type
Name:Protein kinase C epsilon type
Type:Enzyme
Mol. Mass.:83680.45
Organism:Homo sapiens (Human)
Description:The recombinant human PKC enzymes were produced using a baculovirus expression system in SF9 cells
Residue:737
BDBM50319633
NameBDBM50319633
Synonyms:2-amino-N-(7-chloro-1-oxo-1,2-dihydroisoquinolin-6-yl)-2-phenylacetamide | CHEMBL1085141
TypeSmall organic molecule
Emp. Form.C17H14ClN3O2
Mol. Mass.327.765
SMILESNC(C(=O)Nc1cc2cc[nH]c(=O)c2cc1Cl)c1ccccc1