Reaction Details
TargetProtein kinase C epsilon type
LigandBDBM50319636
Substrate/Competitorn/a
Meas. Tech.ChEMBL_634589 (CHEMBL1117930)
IC50>8000±n/a nM
Citation Wu, FBüttner, FHChen, RHickey, EJakes, SKaplita, PKashem, MAKerr, SKugler, SPaw, ZProkopowicz, AShih, CKSnow, RYoung, ECywin, CL Substituted 2H-isoquinolin-1-one as potent Rho-Kinase inhibitors. Part 1: Hit-to-lead account. Bioorg Med Chem Lett20:3235-9 (2010) 
 
Protein kinase C epsilon type
Name:Protein kinase C epsilon type
Type:Enzyme
Mol. Mass.:83680.45
Organism:Homo sapiens (Human)
Description:The recombinant human PKC enzymes were produced using a baculovirus expression system in SF9 cells
Residue:737
BDBM50319636
NameBDBM50319636
Synonyms:CHEMBL1084107 | N-(7-chloro-1-oxo-1,2-dihydroisoquinolin-6-yl)-2-(dimethylamino)-2-phenylacetamide
TypeSmall organic molecule
Emp. Form.C19H18ClN3O2
Mol. Mass.355.818
SMILESCN(C)C(C(=O)Nc1cc2cc[nH]c(=O)c2cc1Cl)c1ccccc1