Reaction Details
TargetNeuronal acetylcholine receptor subunit alpha-7
LigandBDBM50319673
Substrate/Competitorn/a
Meas. Tech.ChEMBL_634707 (CHEMBL1118792)
Ki 44±n/a nM
Citation Ghiron, CHaydar, SNAschmies, SBothmann, HCastaldo, CCocconcelli, GComery, TADi, LDunlop, JLock, TKramer, AKowal, DJow, FGrauer, SHarrison, BLa Rosa, SMaccari, LMarquis, KLMicco, INencini, AQuinn, JRobichaud, AJRoncarati, RScali, CTerstappen, GCTurlizzi, EValacchi, MVarrone, MZanaletti, RZanelli, U Novel alpha-7 nicotinic acetylcholine receptor agonists containing a urea moiety: identification and characterization of the potent, selective, and orally efficacious agonist 1-[6-(4-fluorophenyl)pyridin-3-yl]-3-(4-piperidin-1-ylbutyl) urea (SEN34625/WYE-103914). J Med Chem53:4379-89 (2010) 
 
Neuronal acetylcholine receptor subunit alpha-7
Name:Neuronal acetylcholine receptor subunit alpha-7
Type:Enzyme
Mol. Mass.:56502.44
Organism:Rattus norvegicus (Rat)
Description:Q05941
Residue:502
BDBM50319673
NameBDBM50319673
Synonyms:1-[6-(4-Fluorophenyl)pyridin-3-yl]-3-(4-piperidin-1-ylbutyl)urea | CHEMBL1083787
TypeSmall organic molecule
Emp. Form.C21H27FN4O
Mol. Mass.370.4637
SMILESFc1ccc(cc1)-c1ccc(NC(=O)NCCCCN2CCCCC2)cn1