Reaction Details
TargetProstaglandin E2 receptor EP4 subtype
LigandBDBM50319837
Substrate/Competitorn/a
Meas. Tech.ChEMBL_634915 (CHEMBL1117769)
Ki 0.340000±n/a nM
Citation Colucci, JBoyd, MBerthelette, CChiasson, JFWang, ZDucharme, YFriesen, RWrona, MLevesque, JFDenis, DMathieu, MCStocco, RTherien, AGClarke, PRowland, SXu, DHan, Y Discovery of 4-[1-[([1-[4-(trifluoromethyl)benzyl]-1H-indol-7-yl]carbonyl)amino]cyclopropyl]benzoic acid (MF-766), a highly potent and selective EP4 antagonist for treating inflammatory pain. Bioorg Med Chem Lett20:3760-3 (2010) 
 
Prostaglandin E2 receptor EP4 subtype
Name:Prostaglandin E2 receptor EP4 subtype
Type:Enzyme
Mol. Mass.:53134.53
Organism:Homo sapiens (Human)
Description:P35408
Residue:488
BDBM50319837
NameBDBM50319837
Synonyms:4-(1-(1-(4-(trifluoromethyl)benzyl)-1H-indole-7-carboxamido)cyclopropyl)benzoic acid | CHEMBL1084009
TypeSmall organic molecule
Emp. Form.C27H21F3N2O3
Mol. Mass.478.4624
SMILESOC(=O)c1ccc(cc1)C1(CC1)NC(=O)c1cccc2ccn(Cc3ccc(cc3)C(F)(F)F)c12