Reaction Details
TargetProstaglandin D2 receptor
LigandBDBM50319843
Substrate/Competitorn/a
Meas. Tech.ChEMBL_634906 (CHEMBL1120633)
Ki 63±n/a nM
Citation Colucci, JBoyd, MBerthelette, CChiasson, JFWang, ZDucharme, YFriesen, RWrona, MLevesque, JFDenis, DMathieu, MCStocco, RTherien, AGClarke, PRowland, SXu, DHan, Y Discovery of 4-[1-[([1-[4-(trifluoromethyl)benzyl]-1H-indol-7-yl]carbonyl)amino]cyclopropyl]benzoic acid (MF-766), a highly potent and selective EP4 antagonist for treating inflammatory pain. Bioorg Med Chem Lett20:3760-3 (2010) 
 
Prostaglandin D2 receptor
Name:Prostaglandin D2 receptor
Type:Enzyme
Mol. Mass.:40288.87
Organism:Homo sapiens (Human)
Description:Q13258
Residue:359
BDBM50319843
NameBDBM50319843
Synonyms:(S)-4-(1-(5-chloro-1-(3-chlorobenzyl)-1H-indole-7-carboxamido)ethyl)benzoic acid | CHEMBL1085040
TypeSmall organic molecule
Emp. Form.C25H20Cl2N2O3
Mol. Mass.467.344
SMILESC[C@H](NC(=O)c1cc(Cl)cc2ccn(Cc3cccc(Cl)c3)c12)c1ccc(cc1)C(O)=O