Reaction Details
TargetCorticotropin-releasing factor receptor 1
LigandBDBM50319907
Substrate/Competitorn/a
Meas. Tech.ChEMBL_635026 (CHEMBL1118577)
Ki 9.1±n/a nM
Citation Zuev, DVrudhula, VMMichne, JADasgupta, BPin, SSHuang, XSWu, DGao, QZhang, JTaber, MTMacor, JEDubowchik, GM Discovery of 6-chloro-2-trifluoromethyl-7-aryl-7H-imidazo[1,2-a]imidazol-3-ylmethylamines, a novel class of corticotropin-releasing factor receptor type 1 (CRF1R) antagonists. Bioorg Med Chem Lett20:3669-74 (2010) 
 
Corticotropin-releasing factor receptor 1
Name:Corticotropin-releasing factor receptor 1
Type:Enzyme
Mol. Mass.:50744.31
Organism:Homo sapiens (Human)
Description:P34998
Residue:444
BDBM50319907
NameBDBM50319907
Synonyms:CHEMBL1086468 | N-((2-chloro-1-mesityl-6-(trifluoromethyl)-1H-imidazo[1,2-a]imidazol-5-yl)methyl)-N-(cyclopropylmethyl)propan-1-amine
TypeSmall organic molecule
Emp. Form.C23H28ClF3N4
Mol. Mass.452.943
SMILESCCCN(CC1CC1)Cc1c(nc2n(c(Cl)cn12)-c1c(C)cc(C)cc1C)C(F)(F)F