Reaction Details
TargetNeuronal acetylcholine receptor subunit alpha-4/beta-2
LigandBDBM50319927
Substrate/Competitorn/a
Meas. Tech.ChEMBL_635042 (CHEMBL1118593)
Ki 6±n/a nM
Citation Li, TBunnelle, WHRyther, KBAnderson, DJMalysz, JHelfrich, RGrønlien, JHHåkerud, MPeters, DSchrimpf, MRGopalakrishnan, MJi, J Syntheses and structure-activity relationship (SAR) studies of 2,5-diazabicyclo[2.2.1]heptanes as novel alpha7 neuronal nicotinic receptor (NNR) ligands. Bioorg Med Chem Lett20:3636-9 (2010) 
 
Neuronal acetylcholine receptor subunit alpha-4/beta-2
Name:Neuronal acetylcholine receptor subunit alpha-4/beta-2
Type:n/a
Mol. Mass.:n/a
Description:n/a
Components:This complex has 0 components.
Component 1
Name:Neuronal acetylcholine receptor subunit alpha-4
Synonyms:ACHA4_RAT Cholinergic, Nicotinic Alpha4Beta2 Chrna4 Neuronal acetylcholine receptor (alpha4beta2 nAChR) Neuronal acetylcholine receptor subunit alpha 4 beta 2 | Neuronal acetylcholine receptor subunit alpha-4
Type:Enzyme
Mol. Mass.:70196.44
Organism:Rattus norvegicus (Rat)
Description:P09483
Residue:630
Component 2
Name:Neuronal acetylcholine receptor subunit beta-2
Synonyms:ACHB2_RAT Chrnb2 Neuronal acetylcholine receptor non-alpha-1 chain
Type:Enzyme
Mol. Mass.:56910.32
Organism:Rattus norvegicus (Rat)
Description:P12390
Residue:500
BDBM50319927
NameBDBM50319927
Synonyms:(1S,4S)-2-(6-chloropyridazin-3-yl)-2,5-diazabicyclo[2.2.1]heptane | CHEMBL1083027
TypeSmall organic molecule
Emp. Form.C9H11ClN4
Mol. Mass.210.663
SMILESClc1ccc(nn1)N1C[C@@H]2C[C@H]1CN2