Reaction Details
TargetNeuronal acetylcholine receptor subunit alpha-7
LigandBDBM50319941
Substrate/Competitorn/a
Meas. Tech.ChEMBL_635043 (CHEMBL1118594)
Ki 2.1±n/a nM
Citation Li, TBunnelle, WHRyther, KBAnderson, DJMalysz, JHelfrich, RGrønlien, JHHåkerud, MPeters, DSchrimpf, MRGopalakrishnan, MJi, J Syntheses and structure-activity relationship (SAR) studies of 2,5-diazabicyclo[2.2.1]heptanes as novel alpha7 neuronal nicotinic receptor (NNR) ligands. Bioorg Med Chem Lett20:3636-9 (2010) 
 
Neuronal acetylcholine receptor subunit alpha-7
Name:Neuronal acetylcholine receptor subunit alpha-7
Type:Enzyme
Mol. Mass.:56502.44
Organism:Rattus norvegicus (Rat)
Description:Q05941
Residue:502
BDBM50319941
NameBDBM50319941
Synonyms:5-(6-((1S,4S)-5-methyl-2,5-diazabicyclo[2.2.1]heptan-2-yl)pyridazin-3-yl)-2-(trifluoromethyl)-1H-indole | CHEMBL1083614
TypeSmall organic molecule
Emp. Form.C19H18F3N5
Mol. Mass.373.3749
SMILESCN1C[C@@H]2C[C@H]1CN2c1ccc(nn1)-c1ccc2[nH]c(cc2c1)C(F)(F)F