Reaction Details
TargetNeuronal acetylcholine receptor subunit alpha-7
LigandBDBM50319966
Substrate/Competitorn/a
Meas. Tech.ChEMBL_635043 (CHEMBL1118594)
Ki 10±n/a nM
Citation Li, TBunnelle, WHRyther, KBAnderson, DJMalysz, JHelfrich, RGrønlien, JHHåkerud, MPeters, DSchrimpf, MRGopalakrishnan, MJi, J Syntheses and structure-activity relationship (SAR) studies of 2,5-diazabicyclo[2.2.1]heptanes as novel alpha7 neuronal nicotinic receptor (NNR) ligands. Bioorg Med Chem Lett20:3636-9 (2010) 
 
Neuronal acetylcholine receptor subunit alpha-7
Name:Neuronal acetylcholine receptor subunit alpha-7
Type:Enzyme
Mol. Mass.:56502.44
Organism:Rattus norvegicus (Rat)
Description:Q05941
Residue:502
BDBM50319966
NameBDBM50319966
Synonyms:4-(6-((1S,4S)-5-methyl-2,5-diazabicyclo[2.2.1]heptan-2-yl)pyridin-3-yl)-1H-indole | CHEMBL1085778
TypeSmall organic molecule
Emp. Form.C19H20N4
Mol. Mass.304.3889
SMILESCN1C[C@@H]2C[C@H]1CN2c1ccc(cn1)-c1cccc2[nH]ccc12