Reaction Details
TargetPotassium voltage-gated channel subfamily H member 2
LigandBDBM50319947
Substrate/Competitorn/a
Meas. Tech.ChEMBL_635046 (CHEMBL1118597)
Ki 1.2±n/a nM
Citation Li, TBunnelle, WHRyther, KBAnderson, DJMalysz, JHelfrich, RGrønlien, JHHåkerud, MPeters, DSchrimpf, MRGopalakrishnan, MJi, J Syntheses and structure-activity relationship (SAR) studies of 2,5-diazabicyclo[2.2.1]heptanes as novel alpha7 neuronal nicotinic receptor (NNR) ligands. Bioorg Med Chem Lett20:3636-9 (2010) 
 
Potassium voltage-gated channel subfamily H member 2
Name:Potassium voltage-gated channel subfamily H member 2
Type:Multi-pass membrane protein
Mol. Mass.:126672.65
Organism:Homo sapiens (Human)
Description:Q12809
Residue:1159
BDBM50319947
NameBDBM50319947
Synonyms:(1S,4S)-2-(5-(benzo[b]thiophen-5-yl)pyrazin-2-yl)-5-methyl-2,5-diazabicyclo[2.2.1]heptane | CHEMBL1084022
TypeSmall organic molecule
Emp. Form.C18H18N4S
Mol. Mass.322.427
SMILESCN1C[C@@H]2C[C@H]1CN2c1cnc(cn1)-c1ccc2sccc2c1