Reaction Details
TargetPotassium voltage-gated channel subfamily H member 2
LigandBDBM50319956
Substrate/Competitorn/a
Meas. Tech.ChEMBL_635046 (CHEMBL1118597)
Ki>35±n/a nM
Citation Li, TBunnelle, WHRyther, KBAnderson, DJMalysz, JHelfrich, RGrønlien, JHHåkerud, MPeters, DSchrimpf, MRGopalakrishnan, MJi, J Syntheses and structure-activity relationship (SAR) studies of 2,5-diazabicyclo[2.2.1]heptanes as novel alpha7 neuronal nicotinic receptor (NNR) ligands. Bioorg Med Chem Lett20:3636-9 (2010) 
 
Potassium voltage-gated channel subfamily H member 2
Name:Potassium voltage-gated channel subfamily H member 2
Type:Multi-pass membrane protein
Mol. Mass.:126672.65
Organism:Homo sapiens (Human)
Description:Q12809
Residue:1159
BDBM50319956
NameBDBM50319956
Synonyms:5-(2-((1S,4S)-5-methyl-2,5-diazabicyclo[2.2.1]heptan-2-yl)pyrimidin-5-yl)-1H-indazole | CHEMBL1086523
TypeSmall organic molecule
Emp. Form.C17H18N6
Mol. Mass.306.365
SMILESCN1C[C@@H]2C[C@H]1CN2c1ncc(cn1)-c1ccc2[nH]ncc2c1