Reaction Details
TargetExtracellular calcium-sensing receptor
LigandBDBM50319990
Substrate/Competitorn/a
Meas. Tech.ChEMBL_635061 (CHEMBL1119175)
IC50 220±n/a nM
Citation Shinagawa, YInoue, THirata, KKatsushima, TNakagawa, TMatsuo, YShindo, MHashimoto, H New aminopropandiol derivatives as orally available and short-acting calcium-sensing receptor antagonists. Bioorg Med Chem Lett20:3809-13 (2010) 
 
Extracellular calcium-sensing receptor
Name:Extracellular calcium-sensing receptor
Type:Protein
Mol. Mass.:120663.13
Organism:Homo sapiens (Human)
Description:P41180
Residue:1078
BDBM50319990
NameBDBM50319990
Synonyms:(2R)-1-(2-methyl-1-(naphthalen-2-yl)propan-2-ylamino)-3-(1-phenylethoxy)propan-2-ol | CHEMBL1084757
TypeSmall organic molecule
Emp. Form.C25H31NO2
Mol. Mass.377.5191
SMILESCC(OC[C@H](O)CNC(C)(C)Cc1ccc2ccccc2c1)c1ccccc1