Reaction Details
TargetExtracellular calcium-sensing receptor
LigandBDBM50320021
Substrate/Competitorn/a
Meas. Tech.ChEMBL_635061 (CHEMBL1119175)
IC50 760±n/a nM
Citation Shinagawa, YInoue, THirata, KKatsushima, TNakagawa, TMatsuo, YShindo, MHashimoto, H New aminopropandiol derivatives as orally available and short-acting calcium-sensing receptor antagonists. Bioorg Med Chem Lett20:3809-13 (2010) 
 
Extracellular calcium-sensing receptor
Name:Extracellular calcium-sensing receptor
Type:Protein
Mol. Mass.:120663.13
Organism:Homo sapiens (Human)
Description:P41180
Residue:1078
BDBM50320021
NameBDBM50320021
Synonyms:(S)-1-((S)-cyclopropyl(o-tolyl)methoxy)-3-(2-methyl-1-(naphthalen-2-yl)propan-2-ylamino)propan-2-ol | CHEMBL1085335
TypeSmall organic molecule
Emp. Form.C28H35NO2
Mol. Mass.417.583
SMILESCc1ccccc1[C@@H](OC[C@@H](O)CNC(C)(C)Cc1ccc2ccccc2c1)C1CC1