Reaction Details
TargetCathepsin S
LigandBDBM50320046
Substrate/Competitorn/a
Meas. Tech.ChEMBL_635108 (CHEMBL1119418)
IC50 3.4±n/a nM
Citation Chen, JCUang, BJLyu, PCChang, JYLiu, KJKuo, CCHsieh, HPWang, HCCheng, CSChang, YHChang, MDChang, WSLin, CC Design and synthesis of alpha-ketoamides as cathepsin S inhibitors with potential applications against tumor invasion and angiogenesis. J Med Chem53:4545-9 (2010) 
 
Cathepsin S
Name:Cathepsin S
Type:Protein
Mol. Mass.:37507.38
Organism:Homo sapiens (Human)
Description:P25774
Residue:331
BDBM50320046
NameBDBM50320046
Synonyms:CHEMBL1083930 | Glycine, N-[(3S)-4-benzyloxy-3-[[[2-[(1-methylcyclopropyl)carbonyl)amino]cyclohexyl-L-alanyl]carbonyl]amino]-1,2-dioxobutyl], ethyl ester
TypeSmall organic molecule
Emp. Form.C29H41N3O7
Mol. Mass.543.6517
SMILESCCOC(=O)CNC(=O)C(=O)C(COCc1ccccc1)NC(=O)[C@H](CC1CCCCC1)NC(=O)C1(C)CC1