Reaction Details
TargetCathepsin S
LigandBDBM50320050
Substrate/Competitorn/a
Meas. Tech.ChEMBL_635108 (CHEMBL1119418)
IC50>100±n/a nM
Citation Chen, JCUang, BJLyu, PCChang, JYLiu, KJKuo, CCHsieh, HPWang, HCCheng, CSChang, YHChang, MDChang, WSLin, CC Design and synthesis of alpha-ketoamides as cathepsin S inhibitors with potential applications against tumor invasion and angiogenesis. J Med Chem53:4545-9 (2010) 
 
Cathepsin S
Name:Cathepsin S
Type:Protein
Mol. Mass.:37507.38
Organism:Homo sapiens (Human)
Description:P25774
Residue:331
BDBM50320050
NameBDBM50320050
Synonyms:CHEMBL1085973 | ethyl 2-(4-(benzyloxy)-3-((S)-3-cyclohexyl-2-(4-oxo-4-(pyren-1-yl)butanamido)propanamido)-2-oxobutanamido)acetate
TypeSmall organic molecule
Emp. Form.C44H47N3O8
Mol. Mass.745.8593
SMILESCCOC(=O)CNC(=O)C(=O)C(COCc1ccccc1)NC(=O)[C@H](CC1CCCCC1)NC(=O)CCC(=O)c1ccc2ccc3cccc4ccc1c2c34