Reaction Details
TargetCathepsin S
LigandBDBM50320056
Substrate/Competitorn/a
Meas. Tech.ChEMBL_635108 (CHEMBL1119418)
IC50 6.2±n/a nM
Citation Chen, JCUang, BJLyu, PCChang, JYLiu, KJKuo, CCHsieh, HPWang, HCCheng, CSChang, YHChang, MDChang, WSLin, CC Design and synthesis of alpha-ketoamides as cathepsin S inhibitors with potential applications against tumor invasion and angiogenesis. J Med Chem53:4545-9 (2010) 
 
Cathepsin S
Name:Cathepsin S
Type:Protein
Mol. Mass.:37507.38
Organism:Homo sapiens (Human)
Description:P25774
Residue:331
BDBM50320056
NameBDBM50320056
Synonyms:CHEMBL1085979 | ethyl 2-((S)-3-((S)-2-(2-amino-5-bromobenzamido)-3-cyclohexylpropanamido)-4-(benzyloxy)-2-oxobutanamido)acetate
TypeSmall organic molecule
Emp. Form.C31H39BrN4O7
Mol. Mass.659.568
SMILESCCOC(=O)CNC(=O)C(=O)[C@H](COCc1ccccc1)NC(=O)[C@H](CC1CCCCC1)NC(=O)c1cc(Br)ccc1N