Reaction Details
TargetCathepsin S
LigandBDBM50320062
Substrate/Competitorn/a
Meas. Tech.ChEMBL_635108 (CHEMBL1119418)
IC50 49.2±n/a nM
Citation Chen, JCUang, BJLyu, PCChang, JYLiu, KJKuo, CCHsieh, HPWang, HCCheng, CSChang, YHChang, MDChang, WSLin, CC Design and synthesis of alpha-ketoamides as cathepsin S inhibitors with potential applications against tumor invasion and angiogenesis. J Med Chem53:4545-9 (2010) 
 
Cathepsin S
Name:Cathepsin S
Type:Protein
Mol. Mass.:37507.38
Organism:Homo sapiens (Human)
Description:P25774
Residue:331
BDBM50320062
NameBDBM50320062
Synonyms:CHEMBL1085967 | methyl 4-((2S)-1-(1-(benzyloxy)-4-(2-ethoxy-2-oxoethylamino)-3,4-dioxobutan-2-ylamino)-3-cyclohexyl-1-oxopropan-2-ylcarbamoyl)-2-(tert-butoxycarbonylamino)benzoate
TypeSmall organic molecule
Emp. Form.C38H50N4O11
Mol. Mass.738.8238
SMILESCCOC(=O)CNC(=O)C(=O)C(COCc1ccccc1)NC(=O)[C@H](CC1CCCCC1)NC(=O)c1ccc(C(=O)OC)c(NC(=O)OC(C)(C)C)c1