Reaction Details
TargetPhosphatidylinositol 4,5-bisphosphate 3-kinase catalytic subunit alpha isoform
LigandBDBM50320100
Substrate/Competitorn/a
Meas. Tech.ChEMBL_635344 (CHEMBL1119657)
IC50 0.5±n/a nM
Citation Zhang, NAyral-Kaloustian, SAnderson, JTNguyen, TDas, SVenkatesan, AMBrooijmans, NLucas, JYu, KHollander, IMallon, R 5-ureidobenzofuranone indoles as potent and efficacious inhibitors of PI3 kinase-alpha and mTOR for the treatment of breast cancer. Bioorg Med Chem Lett20:3526-9 (2010) 
 
Phosphatidylinositol 4,5-bisphosphate 3-kinase catalytic subunit alpha isoform
Name:Phosphatidylinositol 4,5-bisphosphate 3-kinase catalytic subunit alpha isoform
Type:Enzyme Subunit
Mol. Mass.:124294.87
Organism:Homo sapiens (Human)
Description:P42336
Residue:1068
BDBM50320100
NameBDBM50320100
Synonyms:1-(2-((7-fluoro-5-methoxy-2-(1,3,5-trimethyl-1H-pyrazol-4-yl)-1H-indol-3-yl)methylene)-3-oxo-2,3-dihydrobenzofuran-5-yl)-3-(4-(morpholine-4-carbonyl)phenyl)urea | CHEMBL1082620
TypeSmall organic molecule
Emp. Form.C36H33FN6O6
Mol. Mass.664.6822
SMILESCOc1cc(F)c2[nH]c(c(\C=C3\Oc4ccc(NC(=O)Nc5ccc(cc5)C(=O)N5CCOCC5)cc4C3=O)c2c1)-c1c(C)nn(C)c1C